{"text_format":"1","workbook":"xlsx","n_sheets":11,"sheets":["ana girdiler","amerikan","Program","kaynatma suyu hesabı","maya tablosu","tahıl tablosu","serbetçi otu tablosu","malt donusum","sot donusum","şeker ve katkılar","utilisation chart"],"not_rendered":{"charts":0,"images":9,"macros":1,"external_links":0,"defined_names":6,"comments":0,"pivot_tables":0},"unopened":[],"bounds":{"document_bytes":16777216,"sheet_cells":100000,"rows_first":2000,"rows_last":500,"rows_between":2000,"halvings":0,"cell_chars":16384,"cell_head_chars":4096},"cells_cut":0,"cells_raw":0,"read":"whole","date_system":"1900"}

{"sheet":"ana girdiler","index":0,"n_rows":94,"n_cols":21,"rows_kept":94,"cut":false,"hidden":false,"merged":[[2,1,2,3],[3,1,3,3],[8,1,8,3],[4,1,4,3],[5,1,5,3],[6,1,6,3],[7,1,7,3],[9,1,9,3],[11,3,12,3],[11,4,12,4],[11,5,12,5],[11,6,12,6],[18,8,20,9],[23,14,23,15],[23,11,23,12],[11,0,12,0],[11,1,12,1],[11,2,12,2],[0,17,0,19],[1,17,1,19],[12,11,12,12],[0,13,0,15],[0,8,1,9],[1,13,1,15],[0,10,0,12],[35,11,35,12],[36,11,36,12],[24,14,24,15],[24,11,24,12],[32,3,32,6],[33,3,34,3],[33,4,34,6],[25,3,25,4],[28,3,30,4],[50,14,50,15],[73,3,74,3],[72,3,72,6],[73,4,74,6],[93,0,95,5]]}
["Sarı Alanları Giriniz",null,null,null,null,null,null,null,"METRİK REÇETE PROGRAMI",null,{"$f":"'ana girdiler'!B3","v":"English Bitter Ale"},null,null,"www.birazbira.com",null,null,null,"Fermantasyon Hacmini Değiştirin"]
[null,null,null,null,null,null,null,null,null,null,"HEDEFLENEN ÖLÇÜLER",null,null,{"$f":"IF(AND(Program!T23>0,Program!P51>0),\"Partial Mash Reçetesi\",IF(Program!T23>0,\"Tam Tahıl Reçetesi\",IF(Program!P51>0,\"Malt Özü-Extract Reçetesi\",0)))","v":"Tam Tahıl Reçetesi"},null,null,null,12,null,null,"sarı alana giriş yaparak hazırladığınız reçeteyi istediğiniz son hacimde oransal değiştirebilirsiniz"]
["Reçete İsmi","English Bitter Ale",null,null,null,null,null,null,null,null,"Fermantasyon Hacmi",{"$f":"IF(R2=0,('ana girdiler'!B4),R2)","v":12},"litre"]
["Fermantasyon Hacmi  (litre)",12,null,null,null,null,null,null,null,null,"Kaynatma Hacmi",{"$f":"'kaynatma suyu hesabı'!B30","v":15.48},"litre"]
["Mayşeleme Süresi (dak)",60,null,null,null,null,null,null,null,null,"İlk yoğunluk (OG)",{"$f":"IFERROR(((Program!K23*'ana girdiler'!B8/100)/('ana girdiler'!L3/3.79)+((Program!J51)/('ana girdiler'!L3/3.79))+1000),0)","v":1059.5320767195767}]
["Kaynatma Süresi (dak)",60,null,null,null,null,null,null,null,null,"Son Yoğunluk (FG)",{"$f":"IFERROR((((L5-1000)*(100-(VLOOKUP(Program!B4,'maya tablosu'!A2:D300,4,0)))/100)+1000),0)","v":1014.8830191798942}]
["Mayşeleme sıcaklığı (0C)",66,null,null,null,null,null,null,null,null,"Tahmini Kaynatma Yoğunluğu",{"$f":"IFERROR(((Program!K23*'ana girdiler'!B8/100)/(L4/3.79)+(Program!J51/(L4/3.79))+1000),0)","v":1046.1488966818424}]
["Mayşe Verimi %",75,null,null,null,null,null,null,null,null,"ABV (Alkol Oranı)",{"$f":"(L5-L6)*0.131","v":5.8490265376984114},"%"]
["Maya Seçimi","Fermentis Safale S-04 ",null,null,null,null,null,null,null,null,"Acılık",{"$f":"IFERROR(Program!I36,0)","v":43.719333333333324},"IBU"]
["protein dinlenmesi (dak)",null,null,null,null,null,null,null,null,null,"Renk (EBC)",{"$f":"IFERROR((Program!N51+Program!P23),0)","v":16.098398954340485},"EBC",{"$f":"L10","v":16.098398954340485}]
[null,null,null,null,null,null,null,null,null,null,"Fermantasyon Sıcaklığı",{"$f":"IFERROR((IF(Program!B5=\"ale\",\"18-22\",\"12-16\")),0)","v":"18-22"},"0C"]
[{"$f":"Program!A12","v":"Malt Türü"},{"$f":"Program!B12","v":"kg"},{"$f":"Program!C12","v":"g"},{"$f":"Program!D12","v":"mayşede % malt oranı kontrolü"},{"$f":"Program!F12","v":"% mayşede malt  yüzdesi"},{"$f":"Program!G12","v":"%mayşede max malt yüzdesi"},{"$f":"Program!L12","v":"% toplam ağırlıkta"},null,null,null,"Tahmini Kalori Hesabı (50cc için)",{"$f":"Program!E55","v":300.37545646239005},"cal"]
[null,null,null,null,null,null,null,null,null,null,"MALT MİKTARI","Malt Miktarı",null,"Yüzde"]
["Maris Otter (Muntons)",null,2700,{"$f":"IFERROR(Program!D13,0)","v":"yüzde uygun"},{"$f":"IFERROR(Program!F13,0)","v":90},{"$f":"Program!G13","v":100},{"$f":"IFERROR(Program!L13,0)","v":85.714285714285708},null,null,null,{"$f":"'ana girdiler'!A14","v":"Maris Otter (Muntons)"},{"$f":"IF((Program!H13)=0,0,Program!H13)","v":2700},{"$f":"IF(L14>0,\"g\",\" \")","v":"g"},{"$f":"IFERROR((Program!L13/100),0)","v":0.8571428571428571}]
["Munich II (weyermann)",null,300,{"$f":"IFERROR(Program!D14,0)","v":"yüzde uygun"},{"$f":"IFERROR(Program!F14,0)","v":10},{"$f":"Program!G14","v":10},{"$f":"IFERROR(Program!L14,0)","v":9.5238095238095237},null,null,null,{"$f":"'ana girdiler'!A15","v":"Munich II (weyermann)"},{"$f":"IF((Program!H14)=0,0,Program!H14)","v":300},{"$f":"IF(L15>0,\"g\",\" \")","v":"g"},{"$f":"IFERROR((Program!L14/100),0)","v":9.5238095238095233E-2}]
{"$rows_left_out":80}
{"sheet":"amerikan","index":1,"n_rows":87,"n_cols":21,"rows_kept":87,"cut":false,"hidden":true,"merged":[[93,0,95,9],[72,3,72,6],[73,3,74,3],[73,4,74,6],[25,3,25,4],[28,3,30,4],[32,3,32,6],[33,3,34,3],[33,4,34,6],[50,14,50,15],[11,6,12,6],[12,11,12,12],[23,11,23,12],[23,14,23,15],[24,11,24,12],[24,14,24,15],[36,11,36,12],[35,11,35,12],[11,0,12,0],[11,1,12,1],[11,2,12,2],[11,3,12,3],[11,4,12,4],[11,5,12,5],[3,1,3,3],[4,1,4,3],[5,1,5,3],[6,1,6,3],[7,1,7,3],[8,1,8,3],[9,1,9,3],[2,1,2,3],[0,8,1,9],[0,10,0,12],[0,13,0,15],[0,17,0,19],[1,17,1,19],[1,13,1,15]]}
["Sarı Alanları Giriniz",null,null,null,null,null,null,null,"AMERİKAN REÇETESİ ",null,{"$f":"amerikan!B3","v":0},null,null,"www.birazbira.com",null,null,null,"Fermantasyon Hacmini Değiştirin"]
[null,null,null,null,null,null,null,null,null,null,"HEDEFLENEN ÖLÇÜLER",null,null,{"$f":"IF(AND(Program!T23>0,Program!P51>0),\"Partial Mash Reçetesi\",IF(Program!T23>0,\"Tam Tahıl Reçetesi\",IF(Program!P51>0,\"Malt Özü-Extract Reçetesi\",0)))","v":"Tam Tahıl Reçetesi"},null,null,null,0,null,null,"sarı alana giriş yaparak hazırladığınız reçeteyi istediğiniz son hacimde oransal değiştirebilirsiniz"]
["Reçete İsmi",null,null,null,null,null,null,null,null,null,"Fermantasyon Hacmi",{"$f":"IF(R2=0,(amerikan!B4*Program!C60),R2)","v":0},"litre"]
["Fermantasyon Hacmi (us gallon)",null,null,null,null,null,null,null,null,null,"Kaynatma Hacmi",{"$f":"'kaynatma suyu hesabı'!B30","v":15.48},"litre"]
["Mayşeleme Süresi (dak)",null,null,null,null,null,null,null,null,null,"İlk yoğunluk (OG)",{"$f":"IFERROR(((Program!K23*amerikan!B8/100)/(amerikan!L3/3.79)+((Program!J51)/(amerikan!L3/3.79))+1000),0)","v":0}]
["Kaynatma Süresi (dak)",null,null,null,null,null,null,null,null,null,"Son Yoğunluk (FG)",{"$f":"IFERROR((((L5-1000)*(100-(VLOOKUP(Program!B4,'maya tablosu'!A2:D300,4,0)))/100)+1000),0)","v":750}]
["Mayşeleme sıcaklığı (fahreneit)",null,null,null,null,null,null,null,null,null,"Tahmini Kaynatma Yoğunluğu",{"$f":"IFERROR(((Program!K23*amerikan!B8/100)/(L4/3.79)+(Program!J51/(L4/3.79))+1000),0)","v":1002.4288892990444}]
["Mayşe Verimi %",null,null,null,null,null,null,null,null,null,"ABV (Alkol Oranı)",{"$f":"(L5-L6)*0.131","v":-98.25},"%"]
["Maya Seçimi",null,null,null,null,null,null,null,null,null,"Acılık",{"$f":"IFERROR(Program!I36,0)","v":43.719333333333324},"IBU"]
["protein dinlenmesi (dak)",null,null,null,null,null,null,null,null,null,"Renk (EBC)",{"$f":"IFERROR((Program!N51+Program!P23),0)","v":16.098398954340485},"EBC",{"$f":"L10","v":16.098398954340485}]
[null,null,null,null,null,null,null,null,null,null,"Fermantasyon Sıcaklığı",{"$f":"IFERROR((IF(Program!B5=\"ale\",\"18-22\",\"12-16\")),0)","v":"18-22"},"0C"]
[{"$f":"Program!A12","v":"Malt Türü"},"libre","oz",{"$f":"Program!D12","v":"mayşede % malt oranı kontrolü"},{"$f":"Program!F12","v":"% mayşede malt  yüzdesi"},{"$f":"Program!G12","v":"%mayşede max malt yüzdesi"},{"$f":"Program!L12","v":"% toplam ağırlıkta"},null,null,null,"Tahmini Kalori Hesabı (50cc için)",{"$f":"Program!E55","v":300.37545646239005},"cal"]
[null,null,null,null,null,null,null,null,null,null,"MALT MİKTARI","Malt Miktarı",null,"Yüzde"]
[null,null,null,{"$f":"IFERROR(Program!D13,0)","v":"yüzde uygun"},{"$f":"IFERROR(Program!F13,0)","v":90},{"$f":"Program!G13","v":100},{"$f":"IFERROR(Program!L13,0)","v":85.714285714285708},null,null,null,{"$f":"amerikan!A14","v":0},{"$f":"IF((Program!H13)=0,0,Program!H13)","v":2700},{"$f":"IF(L14>0,\"g\",\" \")","v":"g"},{"$f":"IFERROR((Program!L13/100),0)","v":0.8571428571428571}]
[null,null,null,{"$f":"IFERROR(Program!D14,0)","v":"yüzde uygun"},{"$f":"IFERROR(Program!F14,0)","v":10},{"$f":"Program!G14","v":10},{"$f":"IFERROR(Program!L14,0)","v":9.5238095238095237},null,null,null,{"$f":"amerikan!A15","v":0},{"$f":"IF((Program!H14)=0,0,Program!H14)","v":300},{"$f":"IF(L15>0,\"g\",\" \")","v":"g"},{"$f":"IFERROR((Program!L14/100),0)","v":9.5238095238095233E-2}]
{"$rows_left_out":73}
{"sheet":"Program","index":2,"n_rows":61,"n_cols":20,"rows_kept":61,"cut":false,"hidden":true,"merged":[[10,1,10,7],[4,1,4,3],[53,1,53,3],[3,1,3,3],[5,1,5,3],[6,1,6,3],[7,1,7,3],[8,1,8,3],[57,1,57,3],[54,1,54,3],[53,4,53,5],[54,4,54,5],[23,1,23,7]]}
["Lütfen Sarı Alanları Giriniz"]
[]
[]
["Maya Seçimi",{"$f":"IF(('ana girdiler'!B9)=0,(amerikan!B9),('ana girdiler'!B9))","v":"Fermentis Safale S-04 "}]
["Maya Tipi",{"$f":"VLOOKUP(B4,'maya tablosu'!A$2:D$299,2,0)","v":"ale"}]
["orjinal tasarım / modifiye tasarım",{"$f":"B8/B7","v":1}]
["Fermantasyon Hacmi",{"$f":"IF(('ana girdiler'!B4)=0,(amerikan!B4*C60),('ana girdiler'!B4))","v":12}]
["Modifiye Fermantasyon Hacmi",{"$f":"IF(('ana girdiler'!R2=0),(amerikan!R2),('ana girdiler'!R2))","v":12}]
["Kaynatma Yoğunluğu",{"$f":"IF(('ana girdiler'!L3)=0,(amerikan!L7),('ana girdiler'!L7))","v":1046.1488966818424}]
[]
[]
["Malt Türü","kg","g","mayşede % malt oranı kontrolü","Cinsi","% mayşede malt  yüzdesi","%mayşede max malt yüzdesi","Toplam malt (g)","Toplam(g) pound","ppg","ppg x ağırlık","% toplam ağırlıkta","renk (SRM)","renk (lovibond)","malt MCU","Düzeltilmiş EBC","Lintern Derecesi"," Lintern Değeri","Kontrol","Nümerik Kontrol"]
[{"$f":"IF(('ana girdiler'!A14)=0,(amerikan!A14),('ana girdiler'!A14))","v":"Maris Otter (Muntons)"},{"$f":"IF(('ana girdiler'!B14)=0,(IF($B$8=0,(amerikan!B14*$C$61),((amerikan!B14*$C$61)*$B$6))),(IF($B$8=0,('ana girdiler'!B14),(('ana girdiler'!B14)*$B$6))))","v":0},{"$f":"IF(('ana girdiler'!C14)=0,(IF($B$8=0,(amerikan!C14*$C$59),((amerikan!C14*$C$59)*$B$6))),(IF($B$8=0,('ana girdiler'!C14),(('ana girdiler'!C14)*$B$6))))","v":2700},{"$f":"IF(A13=0,0,IF((F13>G13),\"yüzdeyi kontrol edin\",\"yüzde uygun\"))","v":"yüzde uygun"},{"$f":"IF(A13=0,0,VLOOKUP(A13,'tahıl tablosu'!A$2:F$35,2,0))","v":"Malt"},{"$f":"IF(A13=0,0,(H13*100/($H$23)))","v":90},{"$f":"IF(A13=0,0,VLOOKUP(A13,'tahıl tablosu'!A$2:F$35,6,0))","v":100},{"$f":"(B13*1000)+(C13)","v":2700},{"$f":"H13/453.6","v":5.9523809523809517},{"$f":"IF(A13=0,0,VLOOKUP(A13,'tahıl tablosu'!A$2:F$35,5,0)-1000)","v":36},{"$f":"(I13*J13)","v":214.28571428571425},{"$f":"IF(A13=0,0,H13*100/($H$23+$G$51))","v":85.714285714285708},{"$f":"IF(A13=0,0,VLOOKUP(A13,'tahıl tablosu'!A$2:F$35,3,0))","v":2.2999999999999998},{"$f":"(M13+0.76)/1.35","v":2.2666666666666662},{"$f":"IF(A13=0,0,((H13/1000)*N13*2.205)/(IF($B$8=0,($B$7*0.264),($B$7*0.264*$B$6))))","v":4.2596590909090901},{"$f":"POWER(O13,0.6859)*1.4922*1.97","v":7.9429433779706651},{"$f":"IF(A13=0,0,VLOOKUP(A13,'tahıl tablosu'!A$2:F$35,4))","v":62},{"$f":"H13*Q13","v":167400},{"$f":"IF(A13=0,0,VLOOKUP(A13,'tahıl tablosu'!$A$2:$F$35,2,0))","v":"Malt"},{"$f":"IF(S13=\"Malt\",1,0)","v":1}]
[{"$f":"IF(('ana girdiler'!A15)=0,(amerikan!A15),('ana girdiler'!A15))","v":"Munich II (weyermann)"},{"$f":"IF(('ana girdiler'!B15)=0,(IF($B$8=0,(amerikan!B15*$C$61),((amerikan!B15*$C$61)*$B$6))),(IF($B$8=0,('ana girdiler'!B15),(('ana girdiler'!B15)*$B$6))))","v":0},{"$f":"IF(('ana girdiler'!C15)=0,(IF($B$8=0,(amerikan!C15*$C$59),((amerikan!C15*$C$59)*$B$6))),(IF($B$8=0,('ana girdiler'!C15),(('ana girdiler'!C15)*$B$6))))","v":300},"yüzde uygun",{"$f":"IF(A14=0,0,VLOOKUP(A14,'tahıl tablosu'!A$2:F$35,2,0))","v":"Malt"},{"$f":"IF(A14=0,0,(H14*100/($H$23)))","v":10},{"$f":"IF(A14=0,0,VLOOKUP(A14,'tahıl tablosu'!A$2:F$35,6,0))","v":10},{"$f":"(B14*1000)+(C14)","v":300},{"$f":"H14/453.6","v":0.66137566137566139},{"$f":"IF(A14=0,0,VLOOKUP(A14,'tahıl tablosu'!A$2:F$35,5,0)-1000)","v":36},23.80952380952381,{"$f":"IF(A14=0,0,H14*100/($H$23+$G$51))","v":9.5238095238095237},{"$f":"IF(A14=0,0,VLOOKUP(A14,'tahıl tablosu'!A$2:F$35,3,0))","v":11},{"$f":"(M14+0.76)/1.35","v":8.7111111111111104},{"$f":"IF(A14=0,0,((H14/1000)*N14*2.205)/(IF($B$8=0,($B$7*0.264),($B$7*0.264*$B$6))))","v":1.8189393939393936},{"$f":"POWER(O14,0.6859)*1.4922","v":2.2492429029565755},{"$f":"IF(A14=0,0,VLOOKUP(A14,'tahıl tablosu'!A$2:F$35,4))","v":0},0,{"$f":"IF(A14=0,0,VLOOKUP(A14,'tahıl tablosu'!$A$2:$F$35,2,0))","v":"Malt"},{"$f":"IF(S14=\"Malt\",1,0)","v":1}]
[{"$f":"IF(('ana girdiler'!A16)=0,(amerikan!A16),('ana girdiler'!A16))","v":0},{"$f":"IF(('ana girdiler'!B16)=0,(IF($B$8=0,(amerikan!B16*$C$61),((amerikan!B16*$C$61)*$B$6))),(IF($B$8=0,('ana girdiler'!B16),(('ana girdiler'!B16)*$B$6))))","v":0},{"$f":"IF(('ana girdiler'!C16)=0,(IF($B$8=0,(amerikan!C16*$C$59),((amerikan!C16*$C$59)*$B$6))),(IF($B$8=0,('ana girdiler'!C16),(('ana girdiler'!C16)*$B$6))))","v":0},0,{"$f":"IF(A15=0,0,VLOOKUP(A15,'tahıl tablosu'!A$2:F$35,2,0))","v":0},0,{"$f":"IF(A15=0,0,VLOOKUP(A15,'tahıl tablosu'!A$2:F$35,6,0))","v":0},0,0,{"$f":"IF(A15=0,0,VLOOKUP(A15,'tahıl tablosu'!A$2:F$35,5,0)-1000)","v":0},0,0,{"$f":"IF(A15=0,0,VLOOKUP(A15,'tahıl tablosu'!A$2:F$35,3,0))","v":0},0.56296296296296289,0,0,{"$f":"IF(A15=0,0,VLOOKUP(A15,'tahıl tablosu'!A$2:F$35,4))","v":0},0,{"$f":"IF(A15=0,0,VLOOKUP(A15,'tahıl tablosu'!$A$2:$F$35,2,0))","v":0},0]
{"$rows_left_out":47}
{"sheet":"kaynatma suyu hesabı","index":3,"n_rows":37,"n_cols":5,"rows_kept":37,"cut":false,"hidden":true,"merged":[[34,0,34,6]]}
["Lütfen Sarı alanları  İhtiyaç Varsa Doldurunuz"]
["Yeşil Alanlar Sonuçtur"]
[]
["ANA GİRDİLER","Süre","Birim"]
["Hedef Şıra",{"$f":"IF(('ana girdiler'!L3)=0,(amerikan!L3),('ana girdiler'!L3))","v":12},"litre"]
["Toplam Malt ve Tahıl",{"$f":"SUM(Program!H23)/1000","v":3},"kg"]
["Tahıl Dışı Katkılar",{"$f":"Program!G51/1000","v":0.15},"kg"]
[]
["MAYŞELEME KADEMESİ","Süre","Birim","Isı Kaynağının Kaynatma oranı  litre/saat"]
["44-59 derecede protein dinlenmesi",{"$f":"IF(('ana girdiler'!$L$3)=0,(amerikan!B10),('ana girdiler'!B10))","v":0},"dakika",{"$f":"IF(('ana girdiler'!$L$3)=0,(amerikan!B83),('ana girdiler'!B83))","v":0.3}]
["ortalama 66 derecede mayşeleme",{"$f":"IF(('ana girdiler'!$L$3)=0,(amerikan!B5),('ana girdiler'!B5))","v":60},"dakika",{"$f":"IF(('ana girdiler'!$L$3)=0,(amerikan!B84),('ana girdiler'!B84))","v":0.5},"mayşeleme süresini ve kazanınızın saatte ne kadar su buharlaştırdığı bilgisini girin"]
["Kaynatma Süresi",{"$f":"IF(('ana girdiler'!$L$3)=0,(amerikan!B6),('ana girdiler'!B6))","v":60},"dakika",{"$f":"IF(('ana girdiler'!$L$3)=0,(amerikan!B85),('ana girdiler'!B85))","v":3},"mayşeleme süresini ve kazanınızın saatte ne kadar su buharlaştırdığı bilgisini girin"]
[]
[]
["TAHMİNİ KAYIPLAR ve ARTIŞLAR","Süre","Birim"]
{"$rows_left_out":23}
{"sheet":"maya tablosu","index":4,"n_rows":38,"n_cols":8,"rows_kept":38,"cut":false,"hidden":true,"merged":[]}
["Maya ","Maya Tipi","Üretici","Attenuation %"]
["Danstar American West Coast Yeast ","ale","Danstar",72,null,null,null,"Maya tablosu değerlerini Türkiye'deki tedarikçilerden veya "]
["Danstar Belle Saison Yeast ","ale","Danstar",80,null,null,null,"http://www.brewunited.com/yeast_database.php"]
["Danstar Diamond Lager ","lager","Danstar",77,null,null,null,"sitesinden alabilirsiniz."]
["Danstar Munich Dry Wheat Yeast ","ale","Danstar",75]
["Danstar Nottingham ","ale","Danstar",80]
["Danstar BRY-97 Ale Bira Mayası","ale","Danstar",75]
["Danstar Windsor ","ale","Danstar",70]
["Fermentis Safale K-97 ","ale","Fermentis",81]
["Fermentis Safale S-04 ","ale","Fermentis",75]
["Fermentis Safale US-05 ","ale","Fermentis",81]
["Fermentis Safbrew Abbaye  BE-256","ale","Fermentis",82]
["Fermentis Safbrew F-2 ","ale","Fermentis",80]
["Fermentis Safbrew S-33 ","ale","Fermentis",70]
["Fermentis Safbrew T-58 ","ale","Fermentis",70]
{"$rows_left_out":24}
{"sheet":"tahıl tablosu","index":5,"n_rows":34,"n_cols":9,"rows_kept":34,"cut":false,"hidden":true,"merged":[]}
["İsim","Tip","Renk (SRM)","Lintern","Tahmini Yoğunluk","partide max %"]
["Amber Malt (muntons)","Malt",22,20,1035,20,null,null,"Malt tablosu değerlerini Türkiye'deki tedarikçilerden veya "]
["Arpa Ezmesi","Tahıl",1.7,0,1032,20,null,null,"http://www.brewunited.com/grain_database.php"]
["Arpa ham","Tahıl",2,0,1028,15,null,null,"sitesinden alabilirsiniz."]
["Arpa Kabuğu","Tahıl",0,0,1000,5]
["Arpa,kavrulmuş","Tahıl",300,0,1025,10]
["Buğday Ezmesi","Tahıl",1.6,0,1035,40]
["Buğday maltı ,açık (weyermann)","Malt",2.2999999999999998,130,1040,60]
["Buğday, kavrulmuş","Tahıl",425,0,1025,10]
["Cara aroma (weyermann)","Malt",195,0,1035,15]
["Cara Münich II (weyermann)","Malt",60,0,1036,10]
["Caraamber (weyermann)","Malt",35,0,1035,20]
["CaraBohemian (weyermann)","Malt",85,0,1034,10]
["Carafa I (weyermann)","Malt",475,0,1036,5]
["Carahell (weyermann)","Malt",12,0,1035,15]
{"$rows_left_out":20}
{"sheet":"serbetçi otu tablosu","index":6,"n_rows":29,"n_cols":8,"rows_kept":29,"cut":false,"hidden":true,"merged":[]}
["İsim","Ülke","Alfa Asit (%)","Kullanım "]
["Amarillo","Amerika",8.4,"Aroma",null,null,null,"ŞOT tablosu değerlerini Türkiye'deki tedarikçilerden veya "]
["Cascade","Amerika",6.9,"Acılık ve Aroma",null,null,null,"http://www.brewunited.com/hop_database.php"]
["Centennial","Amerika",10,"Acılık",null,null,null,"sitesinden alabilirsiniz."]
["Chinook","Amerika",12,"Acılık"]
["Citra","Amerika",12.4,"Aroma"]
["Columbus","Amerika",12.4,"Acılık"]
["El dorado","Amerika",12.4,"Acılık ve Aroma"]
["Equinox","Belçika",16.399999999999999,"Acılık ve Aroma"]
["Fuggle","İngiltere",4.5,"Aroma"]
["Golding","İngiltere",6.2,"Aroma"]
["Hersbrucker","Almanya",3.1,"Aroma"]
["Hüll Melon","Almanya",7.2,"Aroma"]
["Lemondrop","Amerika",5.3,"Aroma"]
["Lubelski","Polonya",3.8,"Aroma"]
{"$rows_left_out":15}
{"sheet":"malt donusum","index":7,"n_rows":0,"n_cols":0,"rows_kept":0,"cut":false,"hidden":true,"merged":[]}

{"sheet":"sot donusum","index":8,"n_rows":0,"n_cols":0,"rows_kept":0,"cut":false,"hidden":true,"merged":[]}

{"sheet":"şeker ve katkılar","index":9,"n_rows":30,"n_cols":9,"rows_kept":30,"cut":false,"hidden":true,"merged":[]}
["İsim","Tip","Renk (SRM)","Tahmini Yoğunluk","partide max %"]
["Akçağaç Şurubu","Katkı",35,1030,10,null,null,null,"Malt dışı katkı tablosu değerlerini Türkiye'deki tedarikçilerden veya "]
["Bal","Katkı",1,1035,100,null,null,null,"http://beersmith.com/grain-list/"]
["Candi Şekeri, açık","Şeker",5,1036,20,null,null,null,"sitesinden alabilirsiniz."]
["Candi Şekeri, Dark","Şeker",177,1036,20]
["DME,  ekstra Koyu","DME",50,1044,100]
["DME, ekstra açıık renk","DME",3,1044,100]
["DME, Koyu","DME",30,1044,100]
["DME, Orta","DME",13,1044,100]
["DME,açık renk","DME",8,1044,100]
["DME,Buğday","DME",6,1044,100]
["Esmer Şeker, Koyu","Şeker",50,1046,10]
["Esmer Şeker, Light","Şeker",8,1046,10]
["Evritik Şeker","Şeker",0,1046,10]
["Hububat,kırma","Katkı",1,1037,10]
{"$rows_left_out":16}
{"sheet":"utilisation chart","index":10,"n_rows":46,"n_cols":12,"rows_kept":46,"cut":false,"hidden":true,"merged":[[0,0,0,11],[1,1,1,11]]}
["%U DEĞERİ"]
["Kaynatma","OG"]
["Süre (dak.)",1030,1040,1050,1060,1070,1080,1090,1100,1110,1120,1130]
[0,0,0,0,0,0,0,0,0,0,0,0]
[3,3.4000000000000002E-2,3.1E-2,2.9000000000000001E-2,2.5999999999999999E-2,2.4E-2,2.1999999999999999E-2,0.02,1.7999999999999999E-2,1.7000000000000001E-2,1.4999999999999999E-2,1.4E-2]
[6,6.5000000000000002E-2,5.8999999999999997E-2,5.3999999999999999E-2,4.9000000000000002E-2,4.4999999999999998E-2,4.1000000000000002E-2,3.7999999999999999E-2,3.5000000000000003E-2,3.2000000000000001E-2,2.9000000000000001E-2,2.5999999999999999E-2]
[9,9.1999999999999998E-2,8.4000000000000005E-2,7.6999999999999999E-2,7.0000000000000007E-2,6.4000000000000001E-2,5.8999999999999997E-2,5.3999999999999999E-2,4.9000000000000002E-2,4.4999999999999998E-2,4.1000000000000002E-2,3.6999999999999998E-2]
[12,0.11600000000000001,0.106,9.7000000000000003E-2,8.7999999999999995E-2,8.1000000000000003E-2,7.3999999999999996E-2,6.8000000000000005E-2,6.2E-2,5.6000000000000001E-2,5.1999999999999998E-2,4.7E-2]
[15,0.13700000000000001,0.125,0.114,0.105,9.6000000000000002E-2,8.6999999999999994E-2,0.08,7.2999999999999995E-2,6.7000000000000004E-2,6.0999999999999999E-2,5.6000000000000001E-2]
[18,0.156,0.14199999999999999,0.13,0.11899999999999999,0.109,9.9000000000000005E-2,9.0999999999999998E-2,8.3000000000000004E-2,7.5999999999999998E-2,6.9000000000000006E-2,6.3E-2]
[21,0.17299999999999999,0.158,0.14399999999999999,0.13200000000000001,0.12,0.11,0.10100000000000001,9.1999999999999998E-2,8.4000000000000005E-2,7.6999999999999999E-2,7.0000000000000007E-2]
[24,0.187,0.17100000000000001,0.157,0.14299999999999999,0.13100000000000001,0.12,0.109,0.1,9.0999999999999998E-2,8.3000000000000004E-2,7.5999999999999998E-2]
[27,0.20100000000000001,0.183,0.16800000000000001,0.153,0.14000000000000001,0.128,0.11700000000000001,0.107,9.8000000000000004E-2,8.8999999999999996E-2,8.2000000000000003E-2]
[30,0.21199999999999999,0.19400000000000001,0.17699999999999999,0.16200000000000001,0.14799999999999999,0.13500000000000001,0.124,0.113,0.10299999999999999,9.4E-2,8.5999999999999993E-2]
[33,0.223,0.20300000000000001,0.186,0.17,0.155,0.14199999999999999,0.13,0.11899999999999999,0.108,9.9000000000000005E-2,9.0999999999999998E-2]
{"$rows_left_out":31}